Reaction Details
TargetIntegrin alpha-L/beta-2
LigandBDBM50154481
Substrate/Competitorn/a
Meas. Tech.ChEMBL_302254 (CHEMBL829489)
Kd 40±n/a nM
Citation Wu, JPEmeigh, JGao, DAGoldberg, DRKuzmich, DMiao, CPotocki, IQian, KCSorcek, RJJeanfavre, DDKishimoto, KMainolfi, EANabozny, GPeng, CReilly, PRothlein, RSellati, RHWoska, JRChen, SGunn, JAO'Brien, DNorris, SHKelly, TA Second-generation lymphocyte function-associated antigen-1 inhibitors: 1H-imidazo[1,2-alpha]imidazol-2-one derivatives. J Med Chem47:5356-66 (2004) 
 
Integrin alpha-L/beta-2
Name:Integrin alpha-L/beta-2
Type:n/a
Mol. Mass.:n/a
Description:ASSAY_ID of EBI is 32646
Components:This complex has 2 components.
Component 1
Name:Integrin alpha-L
Synonyms:CD11 antigen-like family member A CD_antigen=CD11a ITGAL LFA-1A Leukocyte adhesion glycoprotein LFA-1 alpha chain | Leukocyte function-associated molecule 1 alpha chain
Type:PROTEIN
Mol. Mass.:128748.90
Organism:Homo sapiens (Human)
Description:ChEMBL_629045
Residue:1170
Component 2
Name:Integrin beta-2
Synonyms:CD18 ITGB2 MFI7
Type:PROTEIN
Mol. Mass.:84785.60
Organism:Homo sapiens (Human)
Description:EBI_12662
Residue:769
BDBM50154481
NameBDBM50154481
Synonyms:Acetic acid 3-[(R)-5-(4-bromo-benzyl)-7-(3,5-dichloro-phenyl)-5-methyl-6-oxo-6,7-dihydro-5H-imidazo[1,2-a]imidazole-3-sulfonyl]-propyl ester | CHEMBL362735
TypeSmall organic molecule
Emp. Form.C24H22BrCl2N3O5S
Mol. Mass.615.324
SMILESCC(=O)OCCCS(=O)(=O)c1cnc2N(C(=O)[C@@](C)(Cc3ccc(Br)cc3)n12)c1cc(Cl)cc(Cl)c1