Reaction Details
TargetIntegrin alpha-L/beta-2
LigandBDBM50154487
Substrate/Competitorn/a
Meas. Tech.ChEMBL_302249 (CHEMBL830265)
Kd 920.0±n/a nM
Citation Wu, JPEmeigh, JGao, DAGoldberg, DRKuzmich, DMiao, CPotocki, IQian, KCSorcek, RJJeanfavre, DDKishimoto, KMainolfi, EANabozny, GPeng, CReilly, PRothlein, RSellati, RHWoska, JRChen, SGunn, JAO'Brien, DNorris, SHKelly, TA Second-generation lymphocyte function-associated antigen-1 inhibitors: 1H-imidazo[1,2-alpha]imidazol-2-one derivatives. J Med Chem47:5356-66 (2004) 
 
Integrin alpha-L/beta-2
Name:Integrin alpha-L/beta-2
Type:n/a
Mol. Mass.:n/a
Description:ASSAY_ID of EBI is 32646
Components:This complex has 2 components.
Component 1
Name:Integrin alpha-L
Synonyms:CD11 antigen-like family member A CD_antigen=CD11a ITGAL LFA-1A Leukocyte adhesion glycoprotein LFA-1 alpha chain | Leukocyte function-associated molecule 1 alpha chain
Type:PROTEIN
Mol. Mass.:128748.90
Organism:Homo sapiens (Human)
Description:ChEMBL_629045
Residue:1170
Component 2
Name:Integrin beta-2
Synonyms:CD18 ITGB2 MFI7
Type:PROTEIN
Mol. Mass.:84785.60
Organism:Homo sapiens (Human)
Description:EBI_12662
Residue:769
BDBM50154487
NameBDBM50154487
Synonyms:3-(4-Bromo-benzyl)-1-(3,5-dichloro-phenyl)-6-methanesulfonyl-3-methyl-1H-imidazo[1,2-a]imidazol-2-one | CHEMBL189819
TypeSmall organic molecule
Emp. Form.C20H16BrCl2N3O3S
Mol. Mass.529.234
SMILESCC1(Cc2ccc(Br)cc2)C(=O)N(c2nc(cn12)S(C)(=O)=O)c1cc(Cl)cc(Cl)c1