Reaction Details
TargetPoly [ADP-ribose] polymerase 1
LigandBDBM50154730
Substrate/Competitorn/a
Meas. Tech.ChEMBL_302465 (CHEMBL826331)
Ki 6.4±n/a nM
Citation Tikhe, JGWebber, SEHostomsky, ZMaegley, KAEkkers, ALi, JYu, XHAlmassy, RJKumpf, RABoritzki, TJZhang, CCalabrese, CRCurtin, NJKyle, SThomas, HDWang, LZCalvert, AHGolding, BTGriffin, RJNewell, DR Design, synthesis, and evaluation of 3,4-dihydro-2H-[1,4]diazepino[6,7,1-hi]indol-1-ones as inhibitors of poly(ADP-ribose) polymerase. J Med Chem47:5467-81 (2004) 
 
Poly [ADP-ribose] polymerase 1
Name:Poly [ADP-ribose] polymerase 1
Type:n/a
Mol. Mass.:113114.22
Organism:Homo sapiens (Human)
Description:P09874
Residue:1014
BDBM50154730
NameBDBM50154730
Synonyms:6-(4-((dimethylamino)methyl)phenyl)-3,4-dihydro-[1,4]diazepino[6,7,1-hi]indol-1(2H)-one AG-014376 | CHEMBL361489
TypeSmall organic molecule
Emp. Form.C20H21N3O
Mol. Mass.319.4002
SMILESCN(C)Cc1ccc(cc1)-c1cc2cccc3C(=O)NCCn1c23