Reaction Details
TargetPoly [ADP-ribose] polymerase 1
LigandBDBM50154756
Substrate/Competitorn/a
Meas. Tech.ChEMBL_302465 (CHEMBL826331)
Ki 3.8±n/a nM
Citation Tikhe, JGWebber, SEHostomsky, ZMaegley, KAEkkers, ALi, JYu, XHAlmassy, RJKumpf, RABoritzki, TJZhang, CCalabrese, CRCurtin, NJKyle, SThomas, HDWang, LZCalvert, AHGolding, BTGriffin, RJNewell, DR Design, synthesis, and evaluation of 3,4-dihydro-2H-[1,4]diazepino[6,7,1-hi]indol-1-ones as inhibitors of poly(ADP-ribose) polymerase. J Med Chem47:5467-81 (2004) 
 
Poly [ADP-ribose] polymerase 1
Name:Poly [ADP-ribose] polymerase 1
Type:n/a
Mol. Mass.:113114.22
Organism:Homo sapiens (Human)
Description:P09874
Residue:1014
BDBM50154756
NameBDBM50154756
Synonyms:6-(4-Methylaminomethyl-phenyl)-3,4-dihydro-2H-[1,4]diazepino[6,7,1-hi]indol-1-one | CHEMBL361447
TypeSmall organic molecule
Emp. Form.C19H19N3O
Mol. Mass.305.3737
SMILESCNCc1ccc(cc1)-c1cc2cccc3C(=O)NCCn1c23