Reaction Details
TargetPoly [ADP-ribose] polymerase 1
LigandBDBM50154750
Substrate/Competitorn/a
Meas. Tech.ChEMBL_302465 (CHEMBL826331)
Ki 6.8±n/a nM
Citation Tikhe, JGWebber, SEHostomsky, ZMaegley, KAEkkers, ALi, JYu, XHAlmassy, RJKumpf, RABoritzki, TJZhang, CCalabrese, CRCurtin, NJKyle, SThomas, HDWang, LZCalvert, AHGolding, BTGriffin, RJNewell, DR Design, synthesis, and evaluation of 3,4-dihydro-2H-[1,4]diazepino[6,7,1-hi]indol-1-ones as inhibitors of poly(ADP-ribose) polymerase. J Med Chem47:5467-81 (2004) 
 
Poly [ADP-ribose] polymerase 1
Name:Poly [ADP-ribose] polymerase 1
Type:n/a
Mol. Mass.:113114.22
Organism:Homo sapiens (Human)
Description:P09874
Residue:1014
BDBM50154750
NameBDBM50154750
Synonyms:6-(4-Pyrrol-1-ylmethyl-phenyl)-3,4-dihydro-2H-[1,4]diazepino[6,7,1-hi]indol-1-one | CHEMBL188989
TypeSmall organic molecule
Emp. Form.C22H19N3O
Mol. Mass.341.4058
SMILESO=C1NCCn2c(cc3cccc1c23)-c1ccc(Cn2cccc2)cc1