Reaction Details
TargetVascular endothelial growth factor receptor 2
LigandBDBM50155146
Substrate/Competitorn/a
Meas. Tech.ChEMBL_306585 (CHEMBL832932)
IC50 160±n/a nM
Citation Cusack, KPArnold, LDBarberis, CEChen, HEricsson, AMGaza-Bulseco, GSGordon, TDGrinnell, CMHarsch, APellegrini, MTarcsa, E A 13C NMR approach to categorizing potential limitations of alpha,beta-unsaturated carbonyl systems in drug-like molecules. Bioorg Med Chem Lett14:5503-7 (2004) 
 
Vascular endothelial growth factor receptor 2
Name:Vascular endothelial growth factor receptor 2
Type:Receptor Tyrosine Kinase
Mol. Mass.:151510.97
Organism:Homo sapiens (Human)
Description:P35968
Residue:1356
BDBM50155146
NameBDBM50155146
Synonyms:2-[6-(2-Morpholin-4-yl-ethoxy)-1H-indol-3-ylmethylene]-4H-benzo[1,4]thiazin-3-one | CHEMBL187130
TypeSmall organic molecule
Emp. Form.C23H23N3O3S
Mol. Mass.421.512
SMILESO=C1Nc2ccccc2S\C1=C/c1c[nH]c2cc(OCCN3CCOCC3)ccc12