Reaction Details
TargetVascular endothelial growth factor receptor 2
LigandBDBM50155150
Substrate/Competitorn/a
Meas. Tech.ChEMBL_306585 (CHEMBL832932)
IC50 840.0±n/a nM
Citation Cusack, KPArnold, LDBarberis, CEChen, HEricsson, AMGaza-Bulseco, GSGordon, TDGrinnell, CMHarsch, APellegrini, MTarcsa, E A 13C NMR approach to categorizing potential limitations of alpha,beta-unsaturated carbonyl systems in drug-like molecules. Bioorg Med Chem Lett14:5503-7 (2004) 
 
Vascular endothelial growth factor receptor 2
Name:Vascular endothelial growth factor receptor 2
Type:Receptor Tyrosine Kinase
Mol. Mass.:151510.97
Organism:Homo sapiens (Human)
Description:P35968
Residue:1356
BDBM50155150
NameBDBM50155150
Synonyms:5-Cyclopropyl-4-[4-(2-diethylamino-ethyl)-3,5-dimethyl-1H-pyrrol-2-ylmethylene]-2,4-dihydro-pyrazol-3-one | CHEMBL187279
TypeSmall organic molecule
Emp. Form.C19H28N4O
Mol. Mass.328.4518
SMILESCCN(CC)CCc1c(C)[nH]c(C=c2c(=O)[nH][nH]c2=C2CC2)c1C