Reaction Details
TargetVascular endothelial growth factor receptor 2
LigandBDBM50155149
Substrate/Competitorn/a
Meas. Tech.ChEMBL_306585 (CHEMBL832932)
IC50 140±n/a nM
Citation Cusack, KPArnold, LDBarberis, CEChen, HEricsson, AMGaza-Bulseco, GSGordon, TDGrinnell, CMHarsch, APellegrini, MTarcsa, E A 13C NMR approach to categorizing potential limitations of alpha,beta-unsaturated carbonyl systems in drug-like molecules. Bioorg Med Chem Lett14:5503-7 (2004) 
 
Vascular endothelial growth factor receptor 2
Name:Vascular endothelial growth factor receptor 2
Type:Receptor Tyrosine Kinase
Mol. Mass.:151510.97
Organism:Homo sapiens (Human)
Description:P35968
Residue:1356
BDBM50155149
NameBDBM50155149
Synonyms:4-(3-Methyl-1H-indol-2-ylmethylene)-5-pyrazin-2-yl-2,4-dihydro-pyrazol-3-one | CHEMBL366079
TypeSmall organic molecule
Emp. Form.C17H13N5O
Mol. Mass.303.318
SMILESCc1c(\C=C2/C(=O)NN=C2c2cnccn2)[nH]c2ccccc12