Reaction Details
TargetGonadotropin-releasing hormone receptor
LigandBDBM50155355
Substrate/Competitorn/a
Meas. Tech.ChEMBL_312951 (CHEMBL874972)
IC50 0.7±n/a nM
Citation DeVita, RJParikh, MJiang, JFair, JAYoung, JRWalsh, TFGoulet, MTLo, JLRen, NYudkovitz, JBCui, JYang, YTCheng, KRohrer, SPWyvratt, MJ Identification of neutral 4-O-alkyl quinolone nonpeptide GnRH receptor antagonists. Bioorg Med Chem Lett14:5599-603 (2004) 
 
Gonadotropin-releasing hormone receptor
Name:Gonadotropin-releasing hormone receptor
Type:Enzyme
Mol. Mass.:37749.45
Organism:Homo sapiens (Human)
Description:P30968
Residue:328
BDBM50155355
NameBDBM50155355
Synonyms:7-Chloro-2-oxo-4-[2-(5-oxo-pyrrolidin-2-yl)-ethoxy]-3-((R)-3,4,5-trimethyl-phenyl)-1,2-dihydro-quinoline-6-carboxylic acid [1,2,5]thiadiazol-3-ylamide | CHEMBL364167
TypeSmall organic molecule
Emp. Form.C27H26ClN5O4S
Mol. Mass.552.044
SMILESCc1cc(cc(C)c1C)-c1c(OCC[C@H]2CCC(=O)N2)c2cc(C(=O)Nc3cnsn3)c(Cl)cc2[nH]c1=O