Reaction Details
TargetGonadotropin-releasing hormone receptor
LigandBDBM50155356
Substrate/Competitorn/a
Meas. Tech.ChEMBL_306727 (CHEMBL831490)
IC50 0.7±n/a nM
Citation DeVita, RJParikh, MJiang, JFair, JAYoung, JRWalsh, TFGoulet, MTLo, JLRen, NYudkovitz, JBCui, JYang, YTCheng, KRohrer, SPWyvratt, MJ Identification of neutral 4-O-alkyl quinolone nonpeptide GnRH receptor antagonists. Bioorg Med Chem Lett14:5599-603 (2004) 
 
Gonadotropin-releasing hormone receptor
Name:Gonadotropin-releasing hormone receptor
Type:Enzyme
Mol. Mass.:37749.45
Organism:Homo sapiens (Human)
Description:P30968
Residue:328
BDBM50155356
NameBDBM50155356
Synonyms:7-Chloro-4-(2-morpholin-3-yl-ethoxy)-2-oxo-3-(3,4,5-trimethyl-phenyl)-1,2-dihydro-quinoline-6-carboxylic acid [1,2,5]thiadiazol-3-ylamide | CHEMBL424991
TypeSmall organic molecule
Emp. Form.C27H28ClN5O4S
Mol. Mass.554.06
SMILESCc1cc(cc(C)c1C)-c1c(OCCC2COCCN2)c2cc(C(=O)Nc3cnsn3)c(Cl)cc2[nH]c1=O