Reaction Details
TargetGonadotropin-releasing hormone receptor
LigandBDBM50155362
Substrate/Competitorn/a
Meas. Tech.ChEMBL_306727 (CHEMBL831490)
IC50 0.6±n/a nM
Citation DeVita, RJParikh, MJiang, JFair, JAYoung, JRWalsh, TFGoulet, MTLo, JLRen, NYudkovitz, JBCui, JYang, YTCheng, KRohrer, SPWyvratt, MJ Identification of neutral 4-O-alkyl quinolone nonpeptide GnRH receptor antagonists. Bioorg Med Chem Lett14:5599-603 (2004) 
 
Gonadotropin-releasing hormone receptor
Name:Gonadotropin-releasing hormone receptor
Type:Enzyme
Mol. Mass.:37749.45
Organism:Homo sapiens (Human)
Description:P30968
Residue:328
BDBM50155362
NameBDBM50155362
Synonyms:4-[2-(1-Aza-bicyclo[2.2.2]oct-2-yl)-ethoxy]-7-chloro-2-oxo-3-(3,4,5-trimethyl-phenyl)-1,2-dihydro-quinoline-6-carboxylic acid [1,2,5]thiadiazol-3-ylamide | CHEMBL185986
TypeSmall organic molecule
Emp. Form.C30H32ClN5O3S
Mol. Mass.578.125
SMILESCc1cc(cc(C)c1C)-c1c(OCCC2CC3CCN2CC3)c2cc(C(=O)Nc3cnsn3)c(Cl)cc2[nH]c1=O