Reaction Details
TargetGonadotropin-releasing hormone receptor
LigandBDBM50098391
Substrate/Competitorn/a
Meas. Tech.ChEMBL_312951 (CHEMBL874972)
IC50 0.9±n/a nM
Citation DeVita, RJParikh, MJiang, JFair, JAYoung, JRWalsh, TFGoulet, MTLo, JLRen, NYudkovitz, JBCui, JYang, YTCheng, KRohrer, SPWyvratt, MJ Identification of neutral 4-O-alkyl quinolone nonpeptide GnRH receptor antagonists. Bioorg Med Chem Lett14:5599-603 (2004) 
 
Gonadotropin-releasing hormone receptor
Name:Gonadotropin-releasing hormone receptor
Type:Enzyme
Mol. Mass.:37749.45
Organism:Homo sapiens (Human)
Description:P30968
Residue:328
BDBM50098391
NameBDBM50098391
Synonyms:(S)-4-(2-(azetidin-2-yl)ethoxy)-7-chloro-2-oxo-N-(pyrimidin-4-yl)-3-(3,4,5-trimethylphenyl)-1,2-dihydroquinoline-6-carboxamide 4-(2-Azetidin-2-yl-ethoxy)-7-chloro-2-oxo-3-(3,4,5-trimethyl-phenyl)-1,2-dihydro-quinoline-6-carboxylic acid pyrimidin-4-ylamide | CHEMBL120432
TypeSmall organic molecule
Emp. Form.C28H28ClN5O3
Mol. Mass.518.007
SMILESCc1cc(cc(C)c1C)-c1c(OCC[C@@H]2CCN2)c2cc(C(=O)Nc3ccncn3)c(Cl)cc2[nH]c1=O