Reaction Details
TargetKappa-type opioid receptor
LigandBDBM50155498
Substrate/Competitorn/a
Meas. Tech.ChEMBL_302680 (CHEMBL876693)
Ki 0.200000±n/a nM
Citation Tuthill, PASeida, PRBarker, WCassel, JABelanger, SDeHaven, RNKoblish, MGottshall, SLLittle, PJDeHaven-Hudkins, DLDolle, RE Azepinone as a conformational constraint in the design of kappa-opioid receptor agonists. Bioorg Med Chem Lett14:5693-7 (2004) 
 
Kappa-type opioid receptor
Name:Kappa-type opioid receptor
Type:G Protein-Coupled Receptor (GPCR)
Mol. Mass.:42648.76
Organism:Homo sapiens (Human)
Description:P41145
Residue:380
BDBM50155498
NameBDBM50155498
Synonyms:(S)-3-(3,4-Dichloro-phenyl)-1-[(S)-2-((S)-3-hydroxy-pyrrolidin-1-yl)-1-phenyl-ethyl]-1,3,4,7-tetrahydro-azepin-2-one | CHEMBL187124
TypeSmall organic molecule
Emp. Form.C24H26Cl2N2O2
Mol. Mass.445.381
SMILESO[C@H]1CCN(C[C@@H](N2CC=CC[C@@H](c3ccc(Cl)c(Cl)c3)C2=O)c2ccccc2)C1