Reaction Details
TargetCarbonic anhydrase 2
LigandBDBM10876
Substrate/Competitorn/a
Meas. Tech.ChEMBL_305698 (CHEMBL828069)
IC50 5700±n/a nM
Citation Innocenti, AAntel, JWurl, MScozzafava, ASupuran, CT Carbonic anhydrase inhibitors: inhibition of human cytosolic isozyme II and mitochondrial isozyme V with a series of benzene sulfonamide derivatives. Bioorg Med Chem Lett14:5703-7 (2004) 
 
Carbonic anhydrase 2
Name:Carbonic anhydrase 2
Type:Enzyme
Mol. Mass.:29250.71
Organism:Homo sapiens (Human)
Description:P00918
Residue:260
BDBM10876
NameBDBM10876
Synonyms:4-(hydroxymethyl)benzene-1-sulfonamide JMC522226 Compound 20 aromatic/heteroaromatic sulfonamide 21
TypeSmall organic molecule
Emp. Form.C7H9NO3S
Mol. Mass.187.216
SMILESNS(=O)(=O)c1ccc(CO)cc1