Reaction Details
TargetCarbonic anhydrase 5A, mitochondrial
LigandBDBM50155502
Substrate/Competitorn/a
Meas. Tech.ChEMBL_305668 (CHEMBL827937)
IC50 8600±n/a nM
Citation Innocenti, AAntel, JWurl, MScozzafava, ASupuran, CT Carbonic anhydrase inhibitors: inhibition of human cytosolic isozyme II and mitochondrial isozyme V with a series of benzene sulfonamide derivatives. Bioorg Med Chem Lett14:5703-7 (2004) 
 
Carbonic anhydrase 5A, mitochondrial
Name:Carbonic anhydrase 5A, mitochondrial
Type:Enzyme
Mol. Mass.:34755.54
Organism:Homo sapiens (Human)
Description:Human (cloned) isozyme
Residue:305
BDBM50155502
NameBDBM50155502
Synonyms:4-Thiocyanato-benzenesulfonamide | CHEMBL363086
TypeSmall organic molecule
Emp. Form.C7H6N2O2S2
Mol. Mass.214.265
SMILESNS(=O)(=O)c1ccc(SC#N)cc1