Reaction Details
TargetCarbonic anhydrase 2
LigandBDBM50025094
Substrate/Competitorn/a
Meas. Tech.ChEMBL_305698 (CHEMBL828069)
IC50 400±n/a nM
Citation Innocenti, AAntel, JWurl, MScozzafava, ASupuran, CT Carbonic anhydrase inhibitors: inhibition of human cytosolic isozyme II and mitochondrial isozyme V with a series of benzene sulfonamide derivatives. Bioorg Med Chem Lett14:5703-7 (2004) 
 
Carbonic anhydrase 2
Name:Carbonic anhydrase 2
Type:Enzyme
Mol. Mass.:29250.71
Organism:Homo sapiens (Human)
Description:P00918
Residue:260
BDBM50025094
NameBDBM50025094
Synonyms:4-Nitro-benzenesulfonamide CHEMBL282157
TypeSmall organic molecule
Emp. Form.C6H6N2O4S
Mol. Mass.202.188
SMILESNS(=O)(=O)c1ccc(cc1)[N+]([O-])=O