Reaction Details
TargetCarbonic anhydrase 5A, mitochondrial
LigandBDBM50155503
Substrate/Competitorn/a
Meas. Tech.ChEMBL_305668 (CHEMBL827937)
IC50 44900.0±n/a nM
Citation Innocenti, AAntel, JWurl, MScozzafava, ASupuran, CT Carbonic anhydrase inhibitors: inhibition of human cytosolic isozyme II and mitochondrial isozyme V with a series of benzene sulfonamide derivatives. Bioorg Med Chem Lett14:5703-7 (2004) 
 
Carbonic anhydrase 5A, mitochondrial
Name:Carbonic anhydrase 5A, mitochondrial
Type:Enzyme
Mol. Mass.:34755.54
Organism:Homo sapiens (Human)
Description:Human (cloned) isozyme
Residue:305
BDBM50155503
NameBDBM50155503
Synonyms:6-Nitro-benzothiazole-2-sulfonic acid amide | CHEMBL186335
TypeSmall organic molecule
Emp. Form.C7H5N3O4S2
Mol. Mass.259.262
SMILESNS(=O)(=O)c1nc2ccc(cc2s1)[N+]([O-])=O