Reaction Details
TargetCarbonic anhydrase 5A, mitochondrial
LigandBDBM10865
Substrate/Competitorn/a
Meas. Tech.ChEMBL_305668 (CHEMBL827937)
IC50 9400±n/a nM
Citation Innocenti, AAntel, JWurl, MScozzafava, ASupuran, CT Carbonic anhydrase inhibitors: inhibition of human cytosolic isozyme II and mitochondrial isozyme V with a series of benzene sulfonamide derivatives. Bioorg Med Chem Lett14:5703-7 (2004) 
 
Carbonic anhydrase 5A, mitochondrial
Name:Carbonic anhydrase 5A, mitochondrial
Type:Enzyme
Mol. Mass.:34755.54
Organism:Homo sapiens (Human)
Description:Human (cloned) isozyme
Residue:305
BDBM10865
NameBDBM10865
Synonyms:4-Amino-3-iodobenzenesulfonamide CHEMBL268177 halogenosulfanilamide deriv. 5e
TypeSmall organic molecule
Emp. Form.C6H7IN2O2S
Mol. Mass.298.101
SMILESNc1ccc(cc1I)S(N)(=O)=O