Reaction Details
TargetCarbonic anhydrase 5A, mitochondrial
LigandBDBM50025094
Substrate/Competitorn/a
Meas. Tech.ChEMBL_305668 (CHEMBL827937)
IC50 4200±n/a nM
Citation Innocenti, AAntel, JWurl, MScozzafava, ASupuran, CT Carbonic anhydrase inhibitors: inhibition of human cytosolic isozyme II and mitochondrial isozyme V with a series of benzene sulfonamide derivatives. Bioorg Med Chem Lett14:5703-7 (2004) 
 
Carbonic anhydrase 5A, mitochondrial
Name:Carbonic anhydrase 5A, mitochondrial
Type:Enzyme
Mol. Mass.:34755.54
Organism:Homo sapiens (Human)
Description:Human (cloned) isozyme
Residue:305
BDBM50025094
NameBDBM50025094
Synonyms:4-Nitro-benzenesulfonamide CHEMBL282157
TypeSmall organic molecule
Emp. Form.C6H6N2O4S
Mol. Mass.202.188
SMILESNS(=O)(=O)c1ccc(cc1)[N+]([O-])=O