Reaction Details
TargetCarbonic anhydrase 2
LigandBDBM50155504
Substrate/Competitorn/a
Meas. Tech.ChEMBL_305698 (CHEMBL828069)
IC50 290±n/a nM
Citation Innocenti, AAntel, JWurl, MScozzafava, ASupuran, CT Carbonic anhydrase inhibitors: inhibition of human cytosolic isozyme II and mitochondrial isozyme V with a series of benzene sulfonamide derivatives. Bioorg Med Chem Lett14:5703-7 (2004) 
 
Carbonic anhydrase 2
Name:Carbonic anhydrase 2
Type:Enzyme
Mol. Mass.:29250.71
Organism:Homo sapiens (Human)
Description:P00918
Residue:260
BDBM50155504
NameBDBM50155504
Synonyms:2-[4-(aminosulfonyl)phenyl]hydrazinecarbothioamide | CHEMBL186636
TypeSmall organic molecule
Emp. Form.C7H10N4O2S2
Mol. Mass.246.31
SMILESNC(=S)NNc1ccc(cc1)S(N)(=O)=O