Reaction Details
TargetCoagulation factor X
LigandBDBM50155615
Substrate/Competitorn/a
Meas. Tech.ChEMBL_305561 (CHEMBL828580)
IC50 7200±n/a nM
Citation Mederski, WWCezanne, Bvan Amsterdam, CBühring, KUDorsch, DGleitz, JMärz, JTsaklakidis, C Chlorothiophenecarboxamides as P1 surrogates of inhibitors of blood coagulation factor Xa. Bioorg Med Chem Lett14:5817-22 (2004) 
 
Coagulation factor X
Name:Coagulation factor X
Type:Enzyme
Mol. Mass.:54726.60
Organism:Homo sapiens (Human)
Description:n/a
Residue:488
BDBM50155615
NameBDBM50155615
Synonyms:5-Chloro-thiophene-2-carboxylic acid {(R)-3-methyl-1-[3-methyl-4-(3-oxo-morpholin-4-yl)-phenylcarbamoyl]-butyl}-amide | CHEMBL427333
TypeSmall organic molecule
Emp. Form.C22H26ClN3O4S
Mol. Mass.463.978
SMILESCC(C)C[C@@H](NC(=O)c1ccc(Cl)s1)C(=O)Nc1ccc(N2CCOCC2=O)c(C)c1