Reaction Details
TargetProthrombin
LigandBDBM50155629
Substrate/Competitorn/a
Meas. Tech.ChEMBL_305313 (CHEMBL831704)
IC50>10000±n/a nM
Citation Mederski, WWCezanne, Bvan Amsterdam, CBühring, KUDorsch, DGleitz, JMärz, JTsaklakidis, C Chlorothiophenecarboxamides as P1 surrogates of inhibitors of blood coagulation factor Xa. Bioorg Med Chem Lett14:5817-22 (2004) 
 
Prothrombin
Name:Prothrombin
Type:Protein
Mol. Mass.:70029.57
Organism:Homo sapiens (Human)
Description:P00734
Residue:622
BDBM50155629
NameBDBM50155629
Synonyms:5-Chloro-thiophene-2-carboxylic acid {(R)-2-methoxy-1-[3-methyl-4-(3-oxo-morpholin-4-yl)-phenylcarbamoyl]-ethyl}-amide | CHEMBL364838
TypeSmall organic molecule
Emp. Form.C20H22ClN3O5S
Mol. Mass.451.924
SMILESCOC[C@@H](NC(=O)c1ccc(Cl)s1)C(=O)Nc1ccc(N2CCOCC2=O)c(C)c1