Reaction Details
TargetNeuronal acetylcholine receptor subunit alpha-7
LigandBDBM50155635
Substrate/Competitorn/a
Meas. Tech.ChEMBL_303613 (CHEMBL828868)
Ki>50000±n/a nM
Citation Pallavicini, MMoroni, BBolchi, CClementi, FFumagalli, LGotti, CVailati, SValoti, EVilla, L Synthesis and alpha4beta2 nicotinic affinity of 2-pyrrolidinylmethoxyimines and prolinal oxime ethers. Bioorg Med Chem Lett14:5827-30 (2004) 
 
Neuronal acetylcholine receptor subunit alpha-7
Name:Neuronal acetylcholine receptor subunit alpha-7
Type:Enzyme
Mol. Mass.:56502.44
Organism:Rattus norvegicus (Rat)
Description:Q05941
Residue:502
BDBM50155635
NameBDBM50155635
Synonyms:(S)-1-Methyl-pyrrolidine-2-carbaldehyde O-isopropyl-oxime | CHEMBL187861
TypeSmall organic molecule
Emp. Form.C9H18N2O
Mol. Mass.170.252
SMILESCC(C)O\N=C\[C@@H]1CCCN1C