Reaction Details
TargetMetabotropic glutamate receptor 2
LigandBDBM50155696
Substrate/Competitorn/a
Meas. Tech.ChEMBL_304250 (CHEMBL829721)
EC50 578±n/a nM
Citation Pinkerton, ABCube, RVHutchinson, JHJames, JKGardner, MFSchaffhauser, HRowe, BADaggett, LPVernier, JM Allosteric potentiators of the metabotropic glutamate receptor 2 (mGlu2). Part 2: 4-thiopyridyl acetophenones as non-tetrazole containing mGlu2 receptor potentiators. Bioorg Med Chem Lett14:5867-72 (2004) 
 
Metabotropic glutamate receptor 2
Name:Metabotropic glutamate receptor 2
Type:Enzyme
Mol. Mass.:95584.88
Organism:Homo sapiens (Human)
Description:Q14416
Residue:872
BDBM50155696
NameBDBM50155696
Synonyms:1-{2-Hydroxy-3-methyl-4-[4-(pyridin-4-ylsulfanyl)-benzyloxy]-phenyl}-3,3-dimethyl-butan-1-one | CHEMBL182822
TypeSmall organic molecule
Emp. Form.C25H27NO3S
Mol. Mass.421.552
SMILESCc1c(OCc2ccc(Sc3ccncc3)cc2)ccc(C(=O)CC(C)(C)C)c1O