Reaction Details
TargetMetabotropic glutamate receptor 2
LigandBDBM50155713
Substrate/Competitorn/a
Meas. Tech.ChEMBL_304250 (CHEMBL829721)
EC50 1532±n/a nM
Citation Pinkerton, ABCube, RVHutchinson, JHJames, JKGardner, MFSchaffhauser, HRowe, BADaggett, LPVernier, JM Allosteric potentiators of the metabotropic glutamate receptor 2 (mGlu2). Part 2: 4-thiopyridyl acetophenones as non-tetrazole containing mGlu2 receptor potentiators. Bioorg Med Chem Lett14:5867-72 (2004) 
 
Metabotropic glutamate receptor 2
Name:Metabotropic glutamate receptor 2
Type:Enzyme
Mol. Mass.:95584.88
Organism:Homo sapiens (Human)
Description:Q14416
Residue:872
BDBM50155713
NameBDBM50155713
Synonyms:1-{2-Hydroxy-3-methyl-4-[4-(pyridin-2-ylsulfanyl)-butoxy]-phenyl}-3-methyl-butan-1-one US10099993, Compound 184
TypeSmall organic molecule
Emp. Form.C21H27NO3S
Mol. Mass.373.509
SMILESCC(C)CC(=O)c1ccc(OCCCCSc2ccccn2)c(C)c1O