Reaction Details
TargetProlyl endopeptidase
LigandBDBM50155838
Substrate/Competitorn/a
Meas. Tech.ChEMBL_302659 (CHEMBL839948)
Ki 0.02±n/a nM
Citation Jarho, EMVenäläinen, JIHuuskonen, JChristiaans, JAGarcia-Horsman, JAForsberg, MMJärvinen, TGynther, JMännistö, PTWallén, EA A cyclopent-2-enecarbonyl group mimics proline at the P2 position of prolyl oligopeptidase inhibitors. J Med Chem47:5605-7 (2004) 
 
Prolyl endopeptidase
Name:Prolyl endopeptidase
Type:n/a
Mol. Mass.:80758.04
Organism:Sus scrofa
Description:n/a
Residue:710
BDBM50155838
NameBDBM50155838
Synonyms:(S)-1-((S)-1-(4-phenylbutanoyl)pyrrolidine-2-carbonyl)pyrrolidine-2-carbonitrile CHEMBL189620
TypeSmall organic molecule
Emp. Form.C20H25N3O2
Mol. Mass.339.4314
SMILESO=C(CCCc1ccccc1)N1CCC[C@H]1C(=O)N1CCC[C@H]1C#N