Reaction Details
TargetAndrogen receptor
LigandBDBM50131270
Substrate/Competitorn/a
Meas. Tech.ChEMBL_306281 (CHEMBL828424)
IC50 154±n/a nM
Citation Cogan, PSKoch, TH Studies of targeting and intracellular trafficking of an anti-androgen doxorubicin-formaldehyde conjugate in PC-3 prostate cancer cells bearing androgen receptor-GFP chimera. J Med Chem47:5690-9 (2004) 
 
Androgen receptor
Name:Androgen receptor
Type:Receptor
Mol. Mass.:99185.27
Organism:Homo sapiens (Human)
Description:CHO cells were stably transfected with human AR gene.
Residue:920
BDBM50131270
NameBDBM50131270
Synonyms:2-methyl-N-[4-nitro-3-(trifluoromethyl)phenyl]propanamide CHEMBL806 FLUTAMIDE alpha,alpha,alpha-trifluoro-2-methyl-4'-nitro-m-propionotoluidide | niftolid
TypeSmall organic molecule
Emp. Form.C11H11F3N2O3
Mol. Mass.276.2118
SMILESCC(C)C(=O)Nc1ccc(c(c1)C(F)(F)F)[N+]([O-])=O