Reaction Details
TargetAndrogen receptor
LigandBDBM50155877
Substrate/Competitorn/a
Meas. Tech.ChEMBL_306281 (CHEMBL828424)
IC50 63±n/a nM
Citation Cogan, PSKoch, TH Studies of targeting and intracellular trafficking of an anti-androgen doxorubicin-formaldehyde conjugate in PC-3 prostate cancer cells bearing androgen receptor-GFP chimera. J Med Chem47:5690-9 (2004) 
 
Androgen receptor
Name:Androgen receptor
Type:Receptor
Mol. Mass.:99185.27
Organism:Homo sapiens (Human)
Description:CHO cells were stably transfected with human AR gene.
Residue:920
BDBM50155877
NameBDBM50155877
Synonyms:CHEMBL386437 | Doxorubicin-Formaldehyde Conjugate
TypeSmall organic molecule
Emp. Form.C57H56F3N5O17
Mol. Mass.1140.073
SMILESCCCC(=O)Oc1ccc(COCC#CCN2C(=O)N(C(=O)C2(C)C)c2ccc(C#N)c(c2)C(F)(F)F)cc1C(=O)NCN[C@H]1CC(OC2C[C@@](O)(Cc3c(O)c4C(=O)c5cccc(OC)c5C(=O)c4c(O)c23)C(=O)CO)O[C@@H](C)[C@H]1O