Reaction Details
TargetCorticotropin-releasing factor receptor 1
LigandBDBM20977
Substrate/Competitorn/a
Meas. Tech.ChEMBL_306679 (CHEMBL830013)
IC50 0.82±n/a nM
Citation Dzierba, CDTakvorian, AGRafalski, MKasireddy-Polam, PWong, HMolski, TFZhang, GLi, YWLelas, SPeng, YMcElroy, JFZaczek, RCTaub, RACombs, APGilligan, PJTrainor, GL Synthesis, structure-activity relationships, and in vivo properties of 3,4-dihydro-1H-pyrido[2,3-b]pyrazin-2-ones as corticotropin-releasing factor-1 receptor antagonists. J Med Chem47:5783-90 (2004) 
 
Corticotropin-releasing factor receptor 1
Name:Corticotropin-releasing factor receptor 1
Type:G Protein-Coupled Receptor (GPCR)
Mol. Mass.:47870.75
Organism:Rattus norvegicus (rat)
Description:Receptor binding assays were performed using rat cortex homogenate.
Residue:415
BDBM20977
NameBDBM20977
Synonyms:8-[butyl(ethyl)amino]-4-(2,6-dimethoxypyridin-3-yl)-6-methyl-1H,2H,3H,4H-pyrido[2,3-b]pyrazin-2-one Pyridopyrazinone, 2a
TypeSmall organic molecule
Emp. Form.C21H29N5O3
Mol. Mass.399.4867
SMILESCCCCN(CC)c1cc(C)nc2N(CC(=O)Nc12)c1ccc(OC)nc1OC