Reaction Details
TargetCorticotropin-releasing factor receptor 1
LigandBDBM50155973
Substrate/Competitorn/a
Meas. Tech.ChEMBL_306679 (CHEMBL830013)
IC50 1.5±n/a nM
Citation Dzierba, CDTakvorian, AGRafalski, MKasireddy-Polam, PWong, HMolski, TFZhang, GLi, YWLelas, SPeng, YMcElroy, JFZaczek, RCTaub, RACombs, APGilligan, PJTrainor, GL Synthesis, structure-activity relationships, and in vivo properties of 3,4-dihydro-1H-pyrido[2,3-b]pyrazin-2-ones as corticotropin-releasing factor-1 receptor antagonists. J Med Chem47:5783-90 (2004) 
 
Corticotropin-releasing factor receptor 1
Name:Corticotropin-releasing factor receptor 1
Type:G Protein-Coupled Receptor (GPCR)
Mol. Mass.:47870.75
Organism:Rattus norvegicus (rat)
Description:Receptor binding assays were performed using rat cortex homogenate.
Residue:415
BDBM50155973
NameBDBM50155973
Synonyms:4-(2-Chloro-5-fluoro-4-methoxy-phenyl)-8-(ethyl-isopropyl-amino)-6-methyl-3,4-dihydro-1H-pyrido[2,3-b]pyrazin-2-one | CHEMBL363654
TypeSmall organic molecule
Emp. Form.C20H24ClFN4O2
Mol. Mass.406.882
SMILESCCN(C(C)C)c1cc(C)nc2N(CC(=O)Nc12)c1cc(F)c(OC)cc1Cl