Reaction Details
TargetCorticotropin-releasing factor receptor 1
LigandBDBM50074364
Substrate/Competitorn/a
Meas. Tech.ChEMBL_303621 (CHEMBL828876)
Ki 18±n/a nM
Citation Dzierba, CDTakvorian, AGRafalski, MKasireddy-Polam, PWong, HMolski, TFZhang, GLi, YWLelas, SPeng, YMcElroy, JFZaczek, RCTaub, RACombs, APGilligan, PJTrainor, GL Synthesis, structure-activity relationships, and in vivo properties of 3,4-dihydro-1H-pyrido[2,3-b]pyrazin-2-ones as corticotropin-releasing factor-1 receptor antagonists. J Med Chem47:5783-90 (2004) 
 
Corticotropin-releasing factor receptor 1
Name:Corticotropin-releasing factor receptor 1
Type:Enzyme
Mol. Mass.:50744.31
Organism:Homo sapiens (Human)
Description:P34998
Residue:444
BDBM50074364
NameBDBM50074364
Synonyms:CHEMBL350356 | N*2*-(2-Bromo-4-isopropyl-phenyl)-N*4*-butyl-N*2*,N*4*-diethyl-6-methyl-pyrimidine-2,4-diamine
TypeSmall organic molecule
Emp. Form.C22H33BrN4
Mol. Mass.433.428
SMILESCCCCN(CC)c1cc(C)nc(n1)N(CC)c1ccc(cc1Br)C(C)C