Reaction Details
TargetGag-Pol polyprotein [489-587]
LigandBDBM50155984
Substrate/Competitorn/a
Meas. Tech.ChEMBL_303547 (CHEMBL839752)
Ki 0.800000±n/a nM
Citation Huang, DCaflisch, A Efficient evaluation of binding free energy using continuum electrostatics solvation. J Med Chem47:5791-7 (2004) 
 
Gag-Pol polyprotein [489-587]
Name:Gag-Pol polyprotein [489-587]
Type:Enzyme Subunit
Mol. Mass.:10781.16
Organism:Human immunodeficiency virus type 1
Description:P04585[489-587]
Residue:99
BDBM50155984
NameBDBM50155984
Synonyms:2-(2-{(2R,4S)-5-[2-(2-Benzyloxycarbonylamino-propionylamino)-propionylamino]-4-hydroxy-2-isobutyl-6-phenyl-hexanoylamino}-3-methyl-butyrylamino)-3-methyl-butyric acid methyl ester | CHEMBL3143752
TypeSmall organic molecule
Emp. Form.C41H61N5O9
Mol. Mass.767.9511
SMILESCOC(=O)[C@@H](NC(=O)[C@@H](NC(=O)[C@H](CC(C)C)C[C@H](O)[C@H](Cc1ccccc1)NC(=O)[C@H](C)NC(=O)[C@H](C)NC(=O)OCc1ccccc1)C(C)C)C(C)C