Reaction Details
TargetGag-Pol polyprotein [489-587]
LigandBDBM50155990
Substrate/Competitorn/a
Meas. Tech.ChEMBL_303547 (CHEMBL839752)
Ki 0.600000±n/a nM
Citation Huang, DCaflisch, A Efficient evaluation of binding free energy using continuum electrostatics solvation. J Med Chem47:5791-7 (2004) 
 
Gag-Pol polyprotein [489-587]
Name:Gag-Pol polyprotein [489-587]
Type:Enzyme Subunit
Mol. Mass.:10781.16
Organism:Human immunodeficiency virus type 1
Description:P04585[489-587]
Residue:99
BDBM50155990
NameBDBM50155990
Synonyms:CHEMBL187379 | {1-[(2S,4R)-1-Benzyl-4-(1-carbamoyl-2-methyl-propylcarbamoyl)-2-hydroxy-5-phenyl-pentylcarbamoyl]-ethyl}-carbamic acid benzyl ester
TypeSmall organic molecule
Emp. Form.C35H44N4O6
Mol. Mass.616.7471
SMILESCC(C)C(NC(=O)[C@@H](C[C@H](O)C(Cc1ccccc1)NC(=O)C(C)NC(=O)OCc1ccccc1)Cc1ccccc1)C(N)=O