Reaction Details
TargetGag-Pol polyprotein [489-587]
LigandBDBM50155993
Substrate/Competitorn/a
Meas. Tech.ChEMBL_303547 (CHEMBL839752)
Ki 1.4±n/a nM
Citation Huang, DCaflisch, A Efficient evaluation of binding free energy using continuum electrostatics solvation. J Med Chem47:5791-7 (2004) 
 
Gag-Pol polyprotein [489-587]
Name:Gag-Pol polyprotein [489-587]
Type:Enzyme Subunit
Mol. Mass.:10781.16
Organism:Human immunodeficiency virus type 1
Description:P04585[489-587]
Residue:99
BDBM50155993
NameBDBM50155993
Synonyms:CHEMBL364773 | [(2S,4R)-1-Benzyl-4-(1-carbamoyl-2-methyl-propylcarbamoyl)-2-hydroxy-5-phenyl-pentyl]-carbamic acid tert-butyl ester
TypeSmall organic molecule
Emp. Form.C29H41N3O5
Mol. Mass.511.6529
SMILESCC(C)C(NC(=O)[C@@H](C[C@H](O)C(Cc1ccccc1)NC(=O)OC(C)(C)C)Cc1ccccc1)C(N)=O