Reaction Details
TargetGag-Pol polyprotein [489-587]
LigandBDBM50156012
Substrate/Competitorn/a
Meas. Tech.ChEMBL_303547 (CHEMBL839752)
Ki 0.400000±n/a nM
Citation Huang, DCaflisch, A Efficient evaluation of binding free energy using continuum electrostatics solvation. J Med Chem47:5791-7 (2004) 
 
Gag-Pol polyprotein [489-587]
Name:Gag-Pol polyprotein [489-587]
Type:Enzyme Subunit
Mol. Mass.:10781.16
Organism:Human immunodeficiency virus type 1
Description:P04585[489-587]
Residue:99
BDBM50156012
NameBDBM50156012
Synonyms:2-(2-{(2R,4S)-5-[2-(2-Benzyloxycarbonylamino-propionylamino)-propionylamino]-4-hydroxy-6-phenyl-2-propyl-hexanoylamino}-3-methyl-butyrylamino)-3-methyl-butyric acid methyl ester | CHEMBL3143749
TypeSmall organic molecule
Emp. Form.C40H59N5O9
Mol. Mass.753.9246
SMILESCCC[C@H](C[C@H](O)[C@H](Cc1ccccc1)NC(=O)[C@H](C)NC(=O)[C@H](C)NC(=O)OCc1ccccc1)C(=O)N[C@@H](C(C)C)C(=O)N[C@@H](C(C)C)C(=O)OC