Reaction Details
TargetGABA-A receptor; alpha-5/beta-3/gamma-2
LigandBDBM50007664
Substrate/Competitorn/a
Meas. Tech.ChEMBL_303796 (CHEMBL829845)
Ki 368.0±n/a nM
Citation Chambers, MSAtack, JRCarling, RWCollinson, NCook, SMDawson, GRFerris, PHobbs, SCO'connor, DMarshall, GRycroft, WMacleod, AM An orally bioavailable, functionally selective inverse agonist at the benzodiazepine site of GABAA alpha5 receptors with cognition enhancing properties. J Med Chem47:5829-32 (2004) 
 
GABA-A receptor; alpha-5/beta-3/gamma-2
Name:GABA-A receptor; alpha-5/beta-3/gamma-2
Type:n/a
Mol. Mass.:n/a
Description:ASSAY_ID of ChEMBL is 2148177
Components:This complex has 3 components.
Component 1
Name:Gamma-aminobutyric acid receptor subunit gamma-2
Synonyms:GABA(A) receptor subunit gamma-2 GBRG2_HUMAN
Type:PROTEIN
Mol. Mass.:54172.74
Organism:Homo sapiens (Human)
Description:EBI_217
Residue:467
Component 2
Name:Gamma-aminobutyric acid receptor subunit beta-3
Synonyms:GABA A receptor alpha-4/beta-3/gamma-2 GABA-A receptor GBRB3_HUMAN | agonist GABA site
Type:PROTEIN
Mol. Mass.:54130.51
Organism:Homo sapiens (Human)
Description:ChEMBL_448071
Residue:473
Component 3
Name:Gamma-aminobutyric acid receptor subunit alpha-5
Synonyms:GABA receptor alpha-5 subunit GABRA5 Gamma-aminobutyric acid receptor subunit alpha-5 (GABA(A)) | Gamma-aminobutyric acid receptor subunit alpha-5 (GABAA)
Type:Enzyme
Mol. Mass.:52160.59
Organism:Homo sapiens (Human)
Description:P31644
Residue:462
BDBM50007664
NameBDBM50007664
Synonyms:7-chloro-2-methylamino-5-phenyl-3H-1,4-benzodiazepin-4-oxide CDP CHLORDIAZEPOXIDE methaminodiazepoxide
TypeSmall organic molecule
Emp. Form.C16H14ClN3O
Mol. Mass.299.755
SMILESCNC1=Nc2ccc(Cl)cc2C(c2ccccc2)=[N+]([O-])C1