Reaction Details
TargetBeta-1 adrenergic receptor
LigandBDBM50156251
Substrate/Competitorn/a
Meas. Tech.ChEMBL_303399 (CHEMBL840062)
EC50 54±n/a nM
Citation Mizuno, KSawa, MHarada, HTateishi, HOue, MTsujiuchi, HFurutani, YKato, S Tryptamine-based human beta3-adrenergic receptor agonists. Part 1: SAR studies of the 7-position of the indole ring. Bioorg Med Chem Lett14:5959-62 (2004) 
 
Beta-1 adrenergic receptor
Name:Beta-1 adrenergic receptor
Type:G Protein-Coupled Receptor (GPCR)
Mol. Mass.:51338.40
Organism:Homo sapiens (Human)
Description:P08588
Residue:477
BDBM50156251
NameBDBM50156251
Synonyms:CHEMBL186676 | Thiophene-2-sulfonic acid (3-{(R)-2-[(R)-2-(7-benzyloxy-1H-indol-3-yl)-1-methyl-ethylamino]-1-hydroxy-ethyl}-phenyl)-amide
TypeSmall organic molecule
Emp. Form.C30H31N3O4S2
Mol. Mass.561.715
SMILESC[C@H](Cc1c[nH]c2c(OCc3ccccc3)cccc12)NC[C@H](O)c1cccc(NS(=O)(=O)c2cccs2)c1