Reaction Details
TargetBeta-1 adrenergic receptor
LigandBDBM50156253
Substrate/Competitorn/a
Meas. Tech.ChEMBL_303399 (CHEMBL840062)
EC50 58±n/a nM
Citation Mizuno, KSawa, MHarada, HTateishi, HOue, MTsujiuchi, HFurutani, YKato, S Tryptamine-based human beta3-adrenergic receptor agonists. Part 1: SAR studies of the 7-position of the indole ring. Bioorg Med Chem Lett14:5959-62 (2004) 
 
Beta-1 adrenergic receptor
Name:Beta-1 adrenergic receptor
Type:G Protein-Coupled Receptor (GPCR)
Mol. Mass.:51338.40
Organism:Homo sapiens (Human)
Description:P08588
Residue:477
BDBM50156253
NameBDBM50156253
Synonyms:4-[3-(2-{(R)-(R)-2-Hydroxy-2-[3-(thiophene-2-sulfonylamino)-phenyl]-ethylamino}-propyl)-1H-indol-7-yloxysulfonyl]-benzoic acid ethyl ester | CHEMBL186236
TypeSmall organic molecule
Emp. Form.C32H33N3O8S3
Mol. Mass.683.815
SMILESCCOC(=O)c1ccc(cc1)S(=O)(=O)Oc1cccc2c(C[C@@H](C)NC[C@H](O)c3cccc(NS(=O)(=O)c4cccs4)c3)c[nH]c12