Reaction Details
TargetBeta-3 adrenergic receptor
LigandBDBM50156255
Substrate/Competitorn/a
Meas. Tech.ChEMBL_303403 (CHEMBL839160)
EC50 1.1±n/a nM
Citation Mizuno, KSawa, MHarada, HTateishi, HOue, MTsujiuchi, HFurutani, YKato, S Tryptamine-based human beta3-adrenergic receptor agonists. Part 1: SAR studies of the 7-position of the indole ring. Bioorg Med Chem Lett14:5959-62 (2004) 
 
Beta-3 adrenergic receptor
Name:Beta-3 adrenergic receptor
Type:G Protein-Coupled Receptor (GPCR)
Mol. Mass.:43534.88
Organism:Homo sapiens (Human)
Description:n/a
Residue:408
BDBM50156255
NameBDBM50156255
Synonyms:4-[3-(2-{(R)-(R)-2-Hydroxy-2-[3-(thiophene-2-sulfonylamino)-phenyl]-ethylamino}-propyl)-1H-indol-7-yloxysulfonyl]-benzoic acid | CHEMBL362763
TypeSmall organic molecule
Emp. Form.C30H29N3O8S3
Mol. Mass.655.762
SMILESC[C@H](Cc1c[nH]c2c(OS(=O)(=O)c3ccc(cc3)C(O)=O)cccc12)NC[C@H](O)c1cccc(NS(=O)(=O)c2cccs2)c1