Reaction Details
Target5-hydroxytryptamine receptor 1F
LigandBDBM50156410
Substrate/Competitorn/a
Meas. Tech.ChEMBL_302837 (CHEMBL827882)
Ki 3.9±n/a nM
Citation Zhang, DKohlman, DKrushinski, JLiang, SYing, BPReilly, JEDinn, SRWainscott, DBNutter, SGough, WNelson, DLSchaus, JMXu, YC Design, synthesis and evaluation of bicyclic benzamides as novel 5-HT1F receptor agonists. Bioorg Med Chem Lett14:6011-6 (2004) 
 
5-hydroxytryptamine receptor 1F
Name:5-hydroxytryptamine receptor 1F
Type:Enzyme Catalytic Domain
Mol. Mass.:41724.68
Organism:Homo sapiens (Human)
Description:5-HT1F HTR1F HUMAN::P30939
Residue:366
BDBM50156410
NameBDBM50156410
Synonyms:4-Fluoro-N-[3-(1-methyl-piperidin-4-yl)-1H-indazol-5-yl]-benzamide | CHEMBL184597
TypeSmall organic molecule
Emp. Form.C20H21FN4O
Mol. Mass.352.4053
SMILESCN1CCC(CC1)c1n[nH]c2ccc(NC(=O)c3ccc(F)cc3)cc12