Reaction Details
TargetPeroxisomal acyl-coenzyme A oxidase 1
LigandBDBM50156417
Substrate/Competitorn/a
Meas. Tech.ChEMBL_311972 (CHEMBL834389)
IC50 1530±n/a nM
Citation Elzein, EIbrahim, PKoltun, DORehder, KShenk, KDMarquart, TAJiang, BLi, XNatero, RLi, YNguyen, MKerwar, SChu, NSoohoo, DHao, JMaydanik, VYLustig, DAZeng, DLeung, KZablocki, JA CVT-4325: a potent fatty acid oxidation inhibitor with favorable oral bioavailability. Bioorg Med Chem Lett14:6017-21 (2004) 
 
Peroxisomal acyl-coenzyme A oxidase 1
Name:Peroxisomal acyl-coenzyme A oxidase 1
Type:PROTEIN
Mol. Mass.:74693.04
Organism:Rattus norvegicus
Description:ChEMBL_311972
Residue:661
BDBM50156417
NameBDBM50156417
Synonyms:(R)-1-{4-[5-(4-Methoxy-phenyl)-[1,2,4]oxadiazol-3-ylmethyl]-piperazin-1-yl}-3-(2-methyl-benzothiazol-5-yloxy)-propan-2-ol | CHEMBL186246
TypeSmall organic molecule
Emp. Form.C25H29N5O4S
Mol. Mass.495.594
SMILESCOc1ccc(cc1)-c1nc(CN2CCN(C[C@@H](O)COc3ccc4sc(C)nc4c3)CC2)no1