Reaction Details
TargetPeroxisomal acyl-coenzyme A oxidase 1
LigandBDBM50156435
Substrate/Competitorn/a
Meas. Tech.ChEMBL_311972 (CHEMBL834389)
IC50 3630±n/a nM
Citation Elzein, EIbrahim, PKoltun, DORehder, KShenk, KDMarquart, TAJiang, BLi, XNatero, RLi, YNguyen, MKerwar, SChu, NSoohoo, DHao, JMaydanik, VYLustig, DAZeng, DLeung, KZablocki, JA CVT-4325: a potent fatty acid oxidation inhibitor with favorable oral bioavailability. Bioorg Med Chem Lett14:6017-21 (2004) 
 
Peroxisomal acyl-coenzyme A oxidase 1
Name:Peroxisomal acyl-coenzyme A oxidase 1
Type:PROTEIN
Mol. Mass.:74693.04
Organism:Rattus norvegicus
Description:ChEMBL_311972
Residue:661
BDBM50156435
NameBDBM50156435
Synonyms:(R)-1-(2-Methyl-benzothiazol-5-yloxy)-3-{4-[3-(4-trifluoromethyl-phenyl)-[1,2,4]oxadiazol-5-ylmethyl]-piperazin-1-yl}-propan-2-ol | CHEMBL186256
TypeSmall organic molecule
Emp. Form.C25H26F3N5O3S
Mol. Mass.533.566
SMILESCc1nc2cc(OC[C@H](O)CN3CCN(Cc4nc(no4)-c4ccc(cc4)C(F)(F)F)CC3)ccc2s1