Reaction Details
TargetPeroxisomal acyl-coenzyme A oxidase 1
LigandBDBM50156437
Substrate/Competitorn/a
Meas. Tech.ChEMBL_311972 (CHEMBL834389)
IC50 4120.0±n/a nM
Citation Elzein, EIbrahim, PKoltun, DORehder, KShenk, KDMarquart, TAJiang, BLi, XNatero, RLi, YNguyen, MKerwar, SChu, NSoohoo, DHao, JMaydanik, VYLustig, DAZeng, DLeung, KZablocki, JA CVT-4325: a potent fatty acid oxidation inhibitor with favorable oral bioavailability. Bioorg Med Chem Lett14:6017-21 (2004) 
 
Peroxisomal acyl-coenzyme A oxidase 1
Name:Peroxisomal acyl-coenzyme A oxidase 1
Type:PROTEIN
Mol. Mass.:74693.04
Organism:Rattus norvegicus
Description:ChEMBL_311972
Residue:661
BDBM50156437
NameBDBM50156437
Synonyms:(R)-1-{4-[5-(3-Chloro-phenyl)-[1,2,4]oxadiazol-3-ylmethyl]-piperazin-1-yl}-3-(2-methyl-benzothiazol-5-yloxy)-propan-2-ol | CHEMBL186257
TypeSmall organic molecule
Emp. Form.C24H26ClN5O3S
Mol. Mass.500.013
SMILESCc1nc2cc(OC[C@H](O)CN3CCN(Cc4noc(n4)-c4cccc(Cl)c4)CC3)ccc2s1