Reaction Details
TargetB2 bradykinin receptor
LigandBDBM50156449
Substrate/Competitorn/a
Meas. Tech.ChEMBL_303698 (CHEMBL828185)
Ki>10000±n/a nM
Citation Su, DSMarkowitz, MKMurphy, KLWan, BLZrada, MMHarrell, CMO'Malley, SSHess, JFRansom, RWChang, RSWallace, MARaab, CEDean, DCPettibone, DJFreidinger, RMBock, MG Development of an efficient and selective radioligand for bradykinin B1 receptor occupancy studies. Bioorg Med Chem Lett14:6045-8 (2004) 
 
B2 bradykinin receptor
Name:B2 bradykinin receptor
Type:Enzyme Catalytic Domain
Mol. Mass.:44467.17
Organism:Homo sapiens (Human)
Description:B2 BRADYKININ BDKRB2 HUMAN::P30411
Residue:391
BDBM50156449
NameBDBM50156449
Synonyms:2-[(R)-7-Chloro-1-(naphthalene-2-sulfonyl)-3-oxo-1,2,3,4-tetrahydro-quinoxalin-2-yl]-N-{2-[4-(4,5-dihydro-1H-imidazol-2-yl)-phenyl]-ethyl}-acetamide | CHEMBL160547
TypeSmall organic molecule
Emp. Form.C31H28ClN5O4S
Mol. Mass.602.103
SMILESClc1ccc2NC(=O)[C@@H](CC(=O)NCCc3ccc(cc3)C3=NCCN3)N(c2c1)S(=O)(=O)c1ccc2ccccc2c1