Reaction Details
TargetB1 bradykinin receptor
LigandBDBM50156455
Substrate/Competitorn/a
Meas. Tech.ChEMBL_303697 (CHEMBL828184)
Ki 0.03±n/a nM
Citation Su, DSMarkowitz, MKMurphy, KLWan, BLZrada, MMHarrell, CMO'Malley, SSHess, JFRansom, RWChang, RSWallace, MARaab, CEDean, DCPettibone, DJFreidinger, RMBock, MG Development of an efficient and selective radioligand for bradykinin B1 receptor occupancy studies. Bioorg Med Chem Lett14:6045-8 (2004) 
 
B1 bradykinin receptor
Name:B1 bradykinin receptor
Type:Enzyme
Mol. Mass.:40508.87
Organism:Homo sapiens (Human)
Description:P46663
Residue:353
BDBM50156455
NameBDBM50156455
Synonyms:(R)-N-(4-(4,5-dihydro-1H-imidazol-2-yl)phenethyl)-2-(1-(3,4-dichlorophenylsulfonyl)-3-oxo-1,2,3,4-tetrahydroquinoxalin-2-yl)acetamide CHEMBL189123
TypeSmall organic molecule
Emp. Form.C27H25Cl2N5O4S
Mol. Mass.586.49
SMILESClc1ccc(cc1Cl)S(=O)(=O)N1[C@H](CC(=O)NCCc2ccc(cc2)C2=NCCN2)C(=O)Nc2ccccc12