Reaction Details
TargetTyrosine-protein kinase JAK3
LigandBDBM13268
Substrate/Competitorn/a
Meas. Tech.ChEMBL_304689 (CHEMBL827042)
IC50 6±n/a nM
Citation Chen, PNorris, DDas, JSpergel, SHWityak, JLeith, LZhao, RChen, BCPitt, SPang, SShen, DRZhang, RDe Fex, HFDoweyko, AMMcIntyre, KWShuster, DJBehnia, KSchieven, GLBarrish, JC Discovery of novel 2-(aminoheteroaryl)-thiazole-5-carboxamides as potent and orally active Src-family kinase p56(Lck) inhibitors. Bioorg Med Chem Lett14:6061-6 (2004) 
 
Tyrosine-protein kinase JAK3
Name:Tyrosine-protein kinase JAK3
Type:Protein
Mol. Mass.:125111.08
Organism:Homo sapiens (Human)
Description:P52333
Residue:1124
BDBM13268
NameBDBM13268
Synonyms:BMS-354825 2-Heteroarylamino-thiazole Analog 12m N-(2-Chloro-6-methylphenyl)-2-[(2,6-dimethyl-4-pyrimidinyl)-amino]-1,3-thiazole-5-carboxamide | N-(2-chloro-6-methylphenyl)-2-[(2,6-dimethylpyrimidin-4-yl)amino]-1,3-thiazole-5-carboxamide
TypeSmall organic molecule
Emp. Form.C17H16ClN5OS
Mol. Mass.373.86
SMILESCc1cc(Nc2ncc(s2)C(=O)Nc2c(C)cccc2Cl)nc(C)n1