Reaction Details
TargetTubulin beta chain [1-43]
LigandBDBM50156484
Substrate/Competitorn/a
Meas. Tech.ChEMBL_311631 (CHEMBL833941)
IC50 40000±n/a nM
Citation Kim, SPark, JHKoo, SYKim, JIKim, MHKim, JEJo, KChoi, HGLee, SBJung, SH Novel diarylsulfonylurea derivatives as potent antimitotic agents. Bioorg Med Chem Lett14:6075-8 (2004) 
 
Tubulin beta chain [1-43]
Name:Tubulin beta chain [1-43]
Type:PROTEIN
Mol. Mass.:4652.47
Organism:Leishmania donovani
Description:ChEMBL_311916
Residue:43
BDBM50156484
NameBDBM50156484
Synonyms:(S)-1-[1-(5-Nitro-furan-2-carbonyl)-2,3-dihydro-1H-indole-5-sulfonyl]-4-phenyl-imidazolidin-2-one | CHEMBL188420
TypeSmall organic molecule
Emp. Form.C22H18N4O7S
Mol. Mass.482.466
SMILES[O-][N+](=O)c1ccc(o1)C(=O)N1CCc2cc(ccc12)S(=O)(=O)N1C[C@@H](NC1=O)c1ccccc1