Reaction Details
TargetTubulin beta chain [1-43]
LigandBDBM50156486
Substrate/Competitorn/a
Meas. Tech.ChEMBL_311631 (CHEMBL833941)
IC50 30000±n/a nM
Citation Kim, SPark, JHKoo, SYKim, JIKim, MHKim, JEJo, KChoi, HGLee, SBJung, SH Novel diarylsulfonylurea derivatives as potent antimitotic agents. Bioorg Med Chem Lett14:6075-8 (2004) 
 
Tubulin beta chain [1-43]
Name:Tubulin beta chain [1-43]
Type:PROTEIN
Mol. Mass.:4652.47
Organism:Leishmania donovani
Description:ChEMBL_311916
Residue:43
BDBM50156486
NameBDBM50156486
Synonyms:5-((S)-2-Oxo-4-phenyl-imidazolidine-1-sulfonyl)-2,3-dihydro-indole-1-carboxylic acid 2-(4-methyl-piperazin-1-yl)-ethyl ester | CHEMBL364096
TypeSmall organic molecule
Emp. Form.C25H31N5O5S
Mol. Mass.513.609
SMILESCN1CCN(CCOC(=O)N2CCc3cc(ccc23)S(=O)(=O)N2C[C@@H](NC2=O)c2ccccc2)CC1