Reaction Details
TargetTubulin beta chain [1-43]
LigandBDBM50156489
Substrate/Competitorn/a
Meas. Tech.ChEMBL_311631 (CHEMBL833941)
IC50 1500±n/a nM
Citation Kim, SPark, JHKoo, SYKim, JIKim, MHKim, JEJo, KChoi, HGLee, SBJung, SH Novel diarylsulfonylurea derivatives as potent antimitotic agents. Bioorg Med Chem Lett14:6075-8 (2004) 
 
Tubulin beta chain [1-43]
Name:Tubulin beta chain [1-43]
Type:PROTEIN
Mol. Mass.:4652.47
Organism:Leishmania donovani
Description:ChEMBL_311916
Residue:43
BDBM50156489
NameBDBM50156489
Synonyms:5-((S)-2-Oxo-4-phenyl-imidazolidine-1-sulfonyl)-2,3-dihydro-indole-1-carboxylic acid ethyl ester | CHEMBL188768
TypeSmall organic molecule
Emp. Form.C20H21N3O5S
Mol. Mass.415.463
SMILESCCOC(=O)N1CCc2cc(ccc12)S(=O)(=O)N1C[C@@H](NC1=O)c1ccccc1