Reaction Details
TargetDNA-dependent protein kinase catalytic subunit
LigandBDBM50156495
Substrate/Competitorn/a
Meas. Tech.ChEMBL_305712 (CHEMBL827226)
IC50 10±n/a nM
Citation Leahy, JJGolding, BTGriffin, RJHardcastle, IRRichardson, CRigoreau, LSmith, GC Identification of a highly potent and selective DNA-dependent protein kinase (DNA-PK) inhibitor (NU7441) by screening of chromenone libraries. Bioorg Med Chem Lett14:6083-7 (2004) 
 
DNA-dependent protein kinase catalytic subunit
Name:DNA-dependent protein kinase catalytic subunit
Type:Protein
Mol. Mass.:469114.78
Organism:Homo sapiens (Human)
Description:P78527
Residue:4128
BDBM50156495
NameBDBM50156495
Synonyms:8-(dibenzo[b,d]thiophen-4-yl)-2-morpholino-4H-chromen-4-one 8-dibenzothiophen-1-yl-2-morpholin-4-yl-chromen-4-one NU-7432 | NU-7441
TypeSmall organic molecule
Emp. Form.C25H19NO3S
Mol. Mass.413.488
SMILESO=c1cc(oc2c(cccc12)-c1cccc2c3ccccc3sc12)N1CCOCC1